{"text_format":"1","workbook":"xlsx","n_sheets":3,"sheets":["CALCUL DU TARIF 2024","Indépendant","TARIFS 2024"],"not_rendered":{"charts":0,"images":2,"macros":1,"external_links":1,"defined_names":3,"comments":0,"pivot_tables":0},"unopened":[],"bounds":{"document_bytes":16777216,"sheet_cells":100000,"rows_first":2000,"rows_last":500,"rows_between":2000,"halvings":0,"cell_chars":16384,"cell_head_chars":4096},"cells_cut":0,"cells_raw":0,"read":"whole","date_system":"1900"}

{"sheet":"CALCUL DU TARIF 2024","index":0,"n_rows":40,"n_cols":6,"rows_kept":40,"cut":false,"hidden":false,"merged":[[18,1,18,2],[3,0,3,5],[14,0,14,2],[14,3,14,4],[8,0,8,1],[10,0,10,1],[8,3,8,4],[17,1,17,2],[41,0,41,5],[5,2,5,5],[5,0,5,1],[6,2,6,5],[30,0,30,4],[28,0,28,4],[24,0,24,2],[25,1,25,2],[26,1,26,2],[27,0,27,5],[22,1,22,2],[23,0,23,5],[19,1,19,2],[12,0,12,2],[21,0,21,2],[38,0,38,2],[39,4,39,5],[0,0,0,3],[1,1,1,5],[33,0,34,2],[39,0,39,2],[37,0,37,2],[36,0,36,2],[35,1,35,2],[13,1,13,2],[15,1,15,2],[16,1,16,2],[21,3,21,4],[20,1,20,2],[2,3,2,5],[6,0,6,1],[32,0,32,5]]}
["Calcul du tarif de garde des enfants",null,null,null,null,"Tarif 2024"]
["Famille:"]
[]
[]
[]
["familles mariées ou monoparentales",null,"remplir la première colonne en fonction des données de l'avis de taxation fiscale ou la FriTax"]
["familles en union libre",null,"remplir les deux colonnes en fonction des données de l'avis de taxation fiscale ou la FriTax"]
[]
["Nombre d'enfants à charge",null,0,"inscrire le nombre d'enfant(s) à charge \nE figurant sur l'avis de taxation",null,{"$f":"TODAY()","v":"2024-02-29"}]
[]
["Si l'avis de taxation n'est pas disponible,\nutiliser la déclaration FriTax, inscrire F 1",null,0,"noter l'année de \nréférence de F",{"$f":"IF(C11=0,\"AVIS de TAXATION\",\"FriTax\")","v":"AVIS de TAXATION"},2023]
[]
["Personnes salariées/rentières",null,null,"1er avis de taxation","2ème avis de taxation","Montants pris en compte dans le calcul du revenu déterminant"]
[4.91,"Revenu net",null,0,0,{"$f":"D14+E14","v":0}]
["A rajouter les postes suivants:",null,null,"(mettre les valeurs en positif)"]
[4.1100000000000003,"Caisse-maladie et accidents",null,0,0,{"$f":"D16+E16","v":0}]
[4.12,"Autres primes et cotisations",null,0,0,0]
[4.13,"Primes prévoyance liée 3a",null,0,0,0]
[4.1399999999999997,"2ème pilier, caisse de pension",null,0,0,{"$f":"D19+E19","v":0}]
[4.21,"Dettes privées \n(part > fr. 30'000.00)",null,0,0,{"$f":"IF((D20+E20)>30000,((D20+E20)-30000),0)","v":0}]
[4.3099999999999996,"Frais d'immeubles privés \n(part > fr. 15'000.00)",null,0,0,{"$f":"IF((D21+E21)>15000,((D21+E21)-15000),0)","v":0}]
["A rajouter la \"fortune imposable\" (¹ revenu)"]
[7.91,"Fortune imposable\n(vingtième soit 5%)",null,0,0,{"$f":"(D23+E23)*5%","v":0}]
[]
["Personnes imposées à la source",null,null,"1er avis de taxation","2ème avis de taxation","Montants pris en compte dans le calcul du revenu déterminant"]
["Revenu brut soumis à l'impôt","pris en compte à 80%",null,0,0,{"$f":"(D26+E26)*80%","v":0}]
["Fortune imposable","Fortune imposable\n(vingtième soit 5%)",null,0,0]
[]
[null,null,null,null,null,{"$f":"IF(C9>=2,(C9-1)*-11500,0)","v":0}]
[null,null,null,null,null,{"$f":"SUM(F14:F23,F26:F27,F29)","v":0}]
[{"$f":"IF(C11=1,\"REVENU déterminant pour le tarif:  base FriTax\",\"REVENU déterminant pour le tarif:  base AVIS DE TAXATION\")","v":"REVENU déterminant pour le tarif:  base AVIS DE TAXATION"},null,null,null,null,{"$f":"IF(C11=1,VLOOKUP(SUM(F14:F23,F26:F27,F29),'[1]TARIFS 2021'!A3:N35,5,4),SUM(F14:F23,F26:F27,F29))","v":0}]
[]
["Ces tarifs sont indicatifs, les tarifs définitifs sont transmis par la FAEF sur le contrat de placement."]
["Tarif à payer pour les parents",null,null,"Crèche","1-2H","3-8H"]
[null,null,null,{"$f":"IF(F31=0,\"xx\",VLOOKUP($F$31,'TARIFS 2024'!A3:N35,7,4))","v":"xx"},{"$f":"IF(F31=0,\"xx\",VLOOKUP($F$31,'TARIFS 2024'!$A$3:$N$35,10,4))","v":"xx"},{"$f":"IF(F31=0,\"xx\",VLOOKUP($F$31,'TARIFS 2024'!A3:N35,13,4))","v":"xx"}]
[]
["Subvention communale",null,null,{"$f":"IF(F31=0,\"xx\",VLOOKUP($F$31,'TARIFS 2024'!A3:N35,8,4))","v":"xx"},{"$f":"IF(F31=0,\"xx\",VLOOKUP($F$31,'TARIFS 2024'!A3:N35,11,4))","v":"xx"},{"$f":"IF(F31=0,\"xx\",VLOOKUP($F$31,'TARIFS 2024'!A3:N35,11,4))","v":"xx"}]
["Subvention Etat-Employeurs",null,null,15.55,1.3,0]
["Mesure \"réforme fiscale\"",null,null,7.2]
["Ces tarifs sont applicables aux enfants domiciliés dans la commune de Villars-sur-Glâne. Pour les enfants domiciliés dans une autre commune, veuillez-vous adresser au secrétariat.",null,null,"La matinée est facturée à 55% du prix journalier, l'après-midi à 45% du prix journalier","Les plages horaires sont facturées en entier, le tarif horaire est indicatif. \nPour plus de détails, voir la Grille tarifaire de la Fondation"]

{"sheet":"Indépendant","index":1,"n_rows":40,"n_cols":7,"rows_kept":40,"cut":false,"hidden":false,"merged":[[39,0,39,2],[39,4,39,6],[41,0,41,6],[30,0,30,4],[32,0,32,6],[33,0,34,2],[35,1,35,2],[36,0,36,2],[37,0,37,2],[38,0,38,2],[33,4,33,5],[34,4,34,5],[36,4,36,5],[37,4,37,5],[38,4,38,5],[28,0,28,4],[18,1,18,2],[19,1,19,2],[20,1,20,2],[21,0,21,2],[21,3,21,4],[22,1,22,2],[23,0,23,6],[24,0,24,2],[25,1,25,2],[26,1,26,2],[27,0,27,6],[17,1,17,2],[6,0,6,1],[6,2,6,6],[8,0,8,1],[8,3,8,4],[10,0,10,1],[12,0,12,2],[13,1,13,2],[14,0,14,2],[14,3,14,4],[15,1,15,2],[16,1,16,2],[0,0,0,3],[1,1,1,6],[2,3,2,6],[3,0,3,6],[5,0,5,1],[5,2,5,6]]}
["Calcul du tarif de garde des enfants",null,null,null,null,null,"Tarif 2021"]
["Famille:"]
[]
["L’(es) avis de taxation à produire est(sont) celui(ceux) notifié(s) l’année précédant l’année durant laquelle l’enfant est placé. Si celui-ci(ceux-ci) n’est(ne sont) pas disponible(s), les représentants légaux produisent, à titre provisoire, leur(s) dernière(s) déclaration(s) d’impôts FriTax. Le tarif appliqué provisoirement est alors majoré de deux échelons. \nDès réception de l'avis de taxation, le tarif définitif est alors appliqué avec effet rétroactif au 1er janvier de l'année en cours."]
[]
["familles mariées ou monoparentales",null,"remplir la première colonne en fonction des données de l'avis de taxation fiscale ou la FriTax"]
["familles en union libre",null,"remplir les deux colonnes en fonction des données de l'avis de taxation fiscale ou la FriTax"]
[]
["Nombre d'enfants à charge",null,0,"inscrire le nombre d'enfant(s) à charge \nE figurant sur l'avis de taxation",null,null,{"$f":"TODAY()","v":"2024-02-29"}]
[]
["Si l'avis de taxation n'est pas disponible,\nutiliser la déclaration FriTax, inscrire F 1",null,0,"noter l'année de \nréférence de F",{"$f":"IF(C11=0,\"AVIS de TAXATION\",\"FriTax\")","v":"AVIS de TAXATION"},null,2023]
[]
["Indépendants",null,null,"1er avis de taxation","2ème avis de taxation","Indépendant","Montants pris en compte dans le calcul du revenu déterminant"]
[4.91,"Revenu net",null,0,0,0,{"$f":"D14+E14+F14","v":0}]
["A rajouter les postes suivants:",null,null,"(mettre les valeurs en positif)"]
[4.1100000000000003,"Caisse-maladie et accidents",null,0,0,0,{"$f":"D16+E16+F16","v":0}]
[4.12,"Autres primes et cotisations",null,0,0,0,{"$f":"D17+E17+F17","v":0}]
["code 4.130","Prime prévoyances liées 3a",null,0,0,0,{"$f":"D18+E18+F18","v":0}]
[4.1399999999999997,"2ème pilier, caisse de pension\n(part > fr. 15'000.00)",null,0,0,0,{"$f":"IF((D19+E19+F19)>15000,((D19+E19+F19)-15000),0)","v":0}]
[4.21,"Dettes privées \n(part > fr. 30'000.00)",null,0,0,0,{"$f":"IF((D20+E20+F20)>30000,((D20+E20+F20)-30000),0)","v":0}]
[4.3099999999999996,"Frais d'immeubles privés \n(part > fr. 15'000.00)",null,0,0,0,{"$f":"IF((D21+E21+F21)>15000,((D21+E21+F21)-15000),0)","v":0}]
["A rajouter la \"fortune imposable\" (¹ revenu)",null,null,"(seulement les montants positifs)"]
[7.91,"Fortune imposable\n(vingtième soit 5%)",null,0,0,0,{"$f":"(D23+E23+F23)*5%","v":0}]
[]
["Personnes imposées à la source",null,null,"1er avis de taxation","2ème avis de taxation",null,"Montants pris en compte dans le calcul du revenu déterminant"]
["Revenu brut soumis à l'impôt","pris en compte à 80%",null,0,0,0,{"$f":"(D26+E26+F26)*0.8","v":0}]
["Fortune imposable","Fortune imposable\n(vingtième soit 5%)",null,0,0,0,{"$f":"(D27+E27+F27)*5%","v":0}]
[]
["Déduction enfant(s) à charge (- fr. 11'500.00 par enfant, dès le 2ème enfant à charge)",null,null,null,null,null,{"$f":"IF(C9>=2,(C9-1)*-11500,0)","v":0}]
[null,null,null,null,null,null,{"$f":"SUM(G14:G23,G26:G27,G29)","v":0}]
[{"$f":"IF(C11=1,\"REVENU déterminant pour le tarif:  base FriTax\",\"REVENU déterminant pour le tarif:  base AVIS DE TAXATION\")","v":"REVENU déterminant pour le tarif:  base AVIS DE TAXATION"},null,null,null,null,null,{"$f":"IF(C11=1,VLOOKUP(SUM(G14:G23,G26:G27,G29),'TARIFS 2024'!A3:N35,5,4),SUM(G14:G23,G26:G27,G29))","v":0}]
[]
[]
["Tarif à payer pour les parents",null,null,"Crèche","1-2H",null,"3-8H"]
[null,null,null,{"$f":"IF(G31=0,\"xx\",VLOOKUP($G$31,'TARIFS 2024'!A3:N35,7,4))","v":"xx"},{"$f":"IF(G31=0,\"xx\",VLOOKUP($G$31,'TARIFS 2024'!$A$3:$N$35,10,4))","v":"xx"},null,{"$f":"IF(G31=0,\"xx\",VLOOKUP($G$31,'TARIFS 2024'!A3:N35,13,4))","v":"xx"}]
[]
["Subvention communale",null,null,{"$f":"IF(G31=0,\"xx\",VLOOKUP($G$31,'TARIFS 2024'!A3:N35,8,4))","v":"xx"},{"$f":"IF(G31=0,\"xx\",VLOOKUP($G$31,'TARIFS 2024'!A3:N35,11,4))","v":"xx"},null,{"$f":"IF(G31=0,\"xx\",VLOOKUP($G$31,'TARIFS 2024'!A3:N35,11,4))","v":"xx"}]
["Subvention Etat-Employeurs",null,null,15.55,1.3,null,0]
["Mesure \"réforme fiscale\"",null,null,7.2]
["Ces tarifs sont applicables aux enfants domiciliés dans la commune de Villars-sur-Glâne. Pour les enfants domiciliés dans une autre commune, veuillez-vous adresser au secrétariat.",null,null,"La matinée est facturée à 55% du prix journalier, l'après-midi à 45% du prix journalier","Les plages horaires sont facturées en entier, le tarif horaire est indicatif. \nPour plus de détails, voir la Grille tarifaire de la Fondation"]

{"sheet":"TARIFS 2024","index":2,"n_rows":35,"n_cols":16,"rows_kept":35,"cut":false,"hidden":false,"merged":[[37,0,37,11],[0,9,0,10],[0,12,0,13],[0,0,0,2],[1,0,1,2],[36,0,36,2],[36,10,36,11],[0,6,0,7]]}
["ECHELLE DES TARIFS 2015",null,null,null,null,null,"Crèche",null,null,"1-2H",null,null,"3-8H",null,6.9]
["REVENU DETERMINANT",null,null,null,"si FriTax",null,"Tarifs enfants\nCrèche\npar jour","Subvention communale\npar heure de garde",null,"Tarifs enfants\nAVANT-PRIMAIRE\npar heure de garde","Subvention communale\npar heure de garde",null,"Tarifs enfants\nPRIMAIRE\npar heure de garde","Subvention communale\npar heure de garde",{"$f":"135/11.75","v":11.48936170212766},{"$f":"135-15.55-7.2","v":112.25}]
[-10000,"à",40000,null,{"$f":"A5","v":43501},null,13.15,{"$f":"$P$2-G3","v":99.1},null,0.75,{"$f":"$O$2-J3-$O$3","v":9.4389361702127665},null,{"$f":"J3+1.3","v":2.0499999999999998},{"$f":"$O$2-M3","v":9.439361702127659},{"$f":"15.28/11.75","v":1.3004255319148936}]
[40001,"à",43500,null,{"$f":"A6","v":47001},null,13.2,{"$f":"$P$2-G4","v":99.05},null,0.8,{"$f":"$O$2-J4-$O$3","v":9.3889361702127658},null,{"$f":"J4+1.3","v":2.1},{"$f":"$O$2-M4","v":9.3893617021276601}]
[43501,"à",47000,null,50501,null,13.25,{"$f":"$P$2-G5","v":99},null,0.9,9.2889361702127662,null,2.2000000000000002,9.2893617021276604]
[47001,"à",50500,null,54001,null,13.25,99,null,1,9.1889361702127665,null,2.2999999999999998,9.189361702127659]
[50501,"à",54000,null,57501,null,13.3,98.95,null,1.05,9.1389361702127658,null,2.35,9.1393617021276601]
[54001,"à",57500,null,61001,null,13.35,98.9,null,1.1499999999999999,9.0389361702127662,null,2.4500000000000002,9.0393617021276604]
[57501,"à",61000,null,64501,null,14.3,97.95,null,1.25,8.9389361702127665,null,2.5499999999999998,8.939361702127659]
[61001,"à",64500,null,68001,null,15.25,97,null,1.45,8.7389361702127673,null,2.75,8.7393617021276597]
[64501,"à",68000,null,71501,null,16.2,96.05,null,1.65,8.5389361702127662,null,2.95,8.5393617021276604]
[68001,"à",71500,null,75001,null,20.75,91.5,null,1.8,8.3889361702127658,null,3.1,8.3893617021276601]
[71501,"à",75000,null,78501,null,25.35,86.9,null,2,8.1889361702127665,null,3.3,8.189361702127659]
[75001,"à",78500,null,82001,null,30,82.25,null,2.2000000000000002,7.9889361702127673,null,3.5,7.9893617021276597]
[78501,"à",82000,null,86501,null,34.65,77.599999999999994,null,2.4,7.7889361702127662,null,3.7,7.7893617021276595]
[82001,"à",86500,null,91001,null,40.75,71.5,null,2.85,7.3389361702127669,null,4.1500000000000004,7.3393617021276594]
[86501,"à",91000,null,95501,null,47.25,65,null,3.3,6.8889361702127658,null,4.5999999999999996,6.8893617021276601]
[91001,"à",95500,null,100001,null,52.55,59.7,null,3.75,6.4389361702127665,null,5.05,6.4393617021276599]
[95501,"à",100000,null,104501,null,58.1,54.15,null,4.25,5.9389361702127665,null,5.55,5.9393617021276599]
[100001,"à",104500,null,109001,null,63.9,48.35,null,4.75,5.4389361702127665,null,6.05,5.4393617021276599]
[104501,"à",109000,null,113501,null,69.2,43.05,null,5.2,4.9889361702127655,null,6.5,4.9893617021276597]
[109001,"à",113500,null,118001,null,73.5,38.75,null,5.55,4.6389361702127658,null,6.85,4.6393617021276601]
[113501,"à",118000,null,123001,null,75,37.25,null,5.95,4.2389361702127655,null,7.25,4.2393617021276597]
[118001,"à",123000,null,128001,null,76.55,35.700000000000003,null,6.2,3.9889361702127659,null,7.5,3.9893617021276597]
[123001,"à",128000,null,133001,null,78.099999999999994,34.150000000000006,null,6.5,3.6889361702127661,null,7.8,3.6893617021276599]
[128001,"à",133000,null,138001,null,79.650000000000006,32.599999999999994,null,6.75,3.4389361702127661,null,8.0500000000000007,3.439361702127659]
[133001,"à",138000,null,143001,null,81.2,31.049999999999997,null,7.05,3.1389361702127663,null,8.35,3.1393617021276601]
[138001,"à",143000,null,148001,null,82.8,29.450000000000003,null,7.35,2.8389361702127665,null,8.65,2.8393617021276594]
[143001,"à",148000,null,153001,null,84.4,27.849999999999994,null,7.6,2.5889361702127665,null,8.9,2.5893617021276594]
[148001,"à",153000,null,158001,null,87.3,24.950000000000003,null,8.0500000000000007,2.1389361702127654,null,9.3500000000000014,2.1393617021276583]
[153001,"à",158000,null,163001,null,89.4,22.849999999999994,null,8.4,1.7889361702127657,null,9.7000000000000011,1.7893617021276587]
[158001,"à",163000,null,168001,null,90.6,21.650000000000006,null,8.5,1.6889361702127661,null,9.8000000000000007,1.689361702127659]
[163001,"à",168000,null,173001,null,91.8,20.450000000000003,null,8.6,1.5889361702127665,null,9.9,1.5893617021276594]
[168001,"à",173000,null,{"$f":"A35","v":173001},null,93,19.25,null,8.6999999999999993,1.4889361702127668,null,10,1.4893617021276597]
[173001,"à",null,null,{"$f":"A35","v":173001},null,94.2,18.049999999999997,null,8.8000000000000007,1.3889361702127654,null,10.100000000000001,1.3893617021276583]